Search
'분류 전체보기'에 해당되는 글 47건
- 2012.09.25 2012 연봉별 실수령액
- 2012.03.07 slang_rs_export_foreach.cpp , error : variable ‘ParamName’ set but not used
- 2012.03.07 error : undefined reference to `pthread_create'
- 2012.03.07 error : ‘ptrdiff_t’ does not name a type
- 2012.03.07 format_output.h : reference ‘counts’ cannot be declared ‘mutable’
- 2012.03.07 _FORTIFY_SOURCE redefined Error
- 2012.03.05 lib32readline5-dev 설치 중 찾지 못함
- 2011.09.02 LG-SH470 엣지폰
- 2011.09.02 SPH-W3600 시크릿컬러폰
- 2011.05.19 한화 이글스의 노안 vs 동안
slang_rs_export_foreach.cpp , error : variable ‘ParamName’ set but not used
개발노트/Android 2012. 3. 7. 16:55
frameworks/compile/slang/slang_rs_export_foreach.cpp: In static member function ‘static slang::RSExportForEach* slang::RSExportForEach::Create(slang::RSContext*, const clang::FunctionDecl*)’:
frameworks/compile/slang/slang_rs_export_foreach.cpp:249:23: error: variable ‘ParamName’ set but not used [-Werror=unused-but-set-variable]
cc1plus: all warnings being treated as errors
make: *** [out/host/linux-x86/obj/EXECUTABLES/llvm-rs-cc_intermediates/slang_rs_export_foreach.o] Error ...
frameworks/compile/slang/Android.mk 파일 수정
============================================================
위와 같이 -Werror 를 없애준다
frameworks/compile/slang/Android.mk 파일 수정
============================================================
- local_cflags_for_slang := -Wno-sign-promo -Wall -Wno-unused-parameter -Werror
+ local_cflags_for_slang := -Wno-sign-promo -Wall -Wno-unused-parameter
============================================================ 위와 같이 -Werror 를 없애준다
ubuntu 11.10 amd64
ICS
'pthread_create'는 물론 pthread 관련 여러개의 undefined reference error가 발생
external/llvm/lib/Support/Mutex.cpp 파일 수정
=========================================================
ICS
'pthread_create'는 물론 pthread 관련 여러개의 undefined reference error가 발생
external/llvm/lib/Support/Mutex.cpp 파일 수정
=========================================================
#include "llvm/Config/config.h"
#include "llvm/Support/Mutex.h"
+ #undef ENABLE_THREADS
+ #undef HAVE_PTHREAD_H
========================================================
+2차
위 방법으로 해결 되지 않아서 아래 방법으로 해결하였다.
external/llvm/llvm-host-build.mk 파일에 아래 내용 추가
=========================================================
========================================================
+2차
위 방법으로 해결 되지 않아서 아래 방법으로 해결하였다.
external/llvm/llvm-host-build.mk 파일에 아래 내용 추가
=========================================================
=========================================================LOCAL_LDLIBS := \ -lpthread \ -ldl
external/gtest/src/../include/gtest/internal/gtest-param-util.h:122:11: error: ‘ptrdiff_t’ does not name a type
external/gtest/src/../include/gtest/internal/gtest-param-util.h 파일 수정
======================================================
#include <vector>
+ #include <cstddef>
#include <gtest/internal/gtest-port.h>
======================================================
위와 같이 cstddef include 추가
external/gtest/src/../include/gtest/internal/gtest-param-util.h 파일 수정
======================================================
#include <vector>
+ #include <cstddef>
#include <gtest/internal/gtest-port.h>
======================================================
위와 같이 cstddef include 추가
Ubuntu 11.10 amd64
ICS
In file included from external/oprofile/libpp/arrange_profiles.cpp:24:0:
external/oprofile/libpp/format_output.h:94:22: error: reference ‘counts’ cannot be declared ‘mutable’ [-fpermissive]
make: *** [out/host/linux-x86/obj/STATIC_LIBRARIES/liboprofile_pp_intermediates/arrange_profiles.o] 오류 1
external/oprofile/libpp/format_output.h 파일의 94번행
========================================================
- mutable counts_t & counts;
+ counts_t & counts;
========================================================
위와 같이 수정해주자.
ICS
In file included from external/oprofile/libpp/arrange_profiles.cpp:24:0:
external/oprofile/libpp/format_output.h:94:22: error: reference ‘counts’ cannot be declared ‘mutable’ [-fpermissive]
make: *** [out/host/linux-x86/obj/STATIC_LIBRARIES/liboprofile_pp_intermediates/arrange_profiles.o] 오류 1
external/oprofile/libpp/format_output.h 파일의 94번행
========================================================
- mutable counts_t & counts;
+ counts_t & counts;
========================================================
위와 같이 수정해주자.
Ubuntu 11.10 amd64
ICS
<command-line>:0:0: warning: "_FORTIFY_SOURCE" redefined [enabled by default]
/build/core/combo/HOST_linux-x86.mk 파일을 수정해주면 해결된다.
==================================================================================================
- HOST_GLOBAL_CFLAGS += -D_FORTIFY_SOURCE=0
ICS
<command-line>:0:0: warning: "_FORTIFY_SOURCE" redefined [enabled by default]
<built-in>:0:0: note: this is the location of the previous definition
host C: mkyaffs2image <= external/yaffs2/yaffs2/yaffs_tagsvalidity.c
<command-line>:0:0: warning: "_FORTIFY_SOURCE" redefined [enabled by default]
<built-in>:0:0: note: this is the location of the previous definition
In file included from external/yaffs2/yaffs2/yaffs_tagsvalidity.c:17:0:
external/yaffs2/yaffs2/yaffs_tagsvalidity.h:23:6: warning: redundant redeclaration of ‘yaffs_InitialiseTags’ [-Wredundant-decls]
external/yaffs2/yaffs2/yaffs_guts.h:888:6: note: previous declaration of ‘yaffs_InitialiseTags’ was here
host C++: obbtool <= frameworks/base/tools/obbtool/Main.cpp
<command-line>:0:0: error: "_FORTIFY_SOURCE" redefined [-Werror]
<built-in>:0:0: note: this is the location of the previous definition
cc1plus: all warnings being treated as errors
make: *** [out/host/linux-x86/obj/EXECUTABLES/obbtool_intermediates/Main.o] 오류 1
make: *** 끝나지 않은 작업을 기다리고 있습니다....
/build/core/combo/HOST_linux-x86.mk 파일을 수정해주면 해결된다.
==================================================================================================
- HOST_GLOBAL_CFLAGS += -D_FORTIFY_SOURCE=0
+ HOST_GLOBAL_CFLAGS += -U_FORTIFY_SOURCE -D_FORTIFY_SOURCE=0
==================================================================================================
위와 같이 수정
위와 같이 수정
Ubuntu 11.10 amd64
안드로이드 환경 설치 중 lib32readline5-dev 를 찾을 수 없다고 설치가 되지 않는다.
apt-get install 메시지에서 lib32readline-gplv2-dev 로 대체 가능하다고 나오기에 lib32readline-gplv2-dev 를 설치하여 해결.
안드로이드 환경 설치 중 lib32readline5-dev 를 찾을 수 없다고 설치가 되지 않는다.
apt-get install 메시지에서 lib32readline-gplv2-dev 로 대체 가능하다고 나오기에 lib32readline-gplv2-dev 를 설치하여 해결.
액정과 터치센서의 백라이트가 켜진 모습
키패드 슬라이드를 열어둔 모습
뒷면. 금속재질의 배터리커버는 전체적으로 무광처리 되었으며 LG와 T의 로고도 금색으로 처리되어있다.
2백만 화소의 카메라와 셀카 거울. 해외 모델의 경우 3백만 화소 AF 카메라에 플래쉬도 내장되어있지만 국내 모델은 스펙다운 되었다.
슬라이드 안쪽에 위치해있어 슬라이드를 닫은채로 촬영이 불가능하지만, 평소에 카메라부분이 보호되는 효과도 있다.
배터리 커버를 벗기면 눈부신 자태를 볼 수 있다. 자꾸 배터리 커버를 벗기고 싶어진다.
제조사 : LG전자
모델명 : LG-SH470 ( 팻네임 엣지폰 )
통신사 : SKT / 3G HSDPA
사용기간 : 2009년 4월부터 2009년 8월까지
역시나 디자인을 보고 사용하게 된 폰.
슬라이드를 시켜주는 부분을 뒷면이 아닌 양 사이드로 옮기면서 당시 슬라이드 폰에서 볼 수 없었던 슬림함을 보여주었다. 슬라이드를 올린 상태에서도 일반적인 계단형태의 모습이 아닌 일자형이 모습을 유지하였다.
게다가 전면 하단의 터치 센서는 터치하는 방향에 따라 LED 백라이트가 따라오는 모습의 효과를 보여주었다.
하지만 디자인으로 커버되지 않는 단점이 여럿 있었는데 첫째로 전면 하단의 터치 센서가 오동작하게 되는 경우가 많이 발생하였다. 터치 센서 하나하나는 우수한 동작을 보여주었지만 저 좁은곳에 아홉개의 센서를 넣다보니 사용자의 의도와는 다르게 다른 센서를 동작시키게 되는 경우가 많았다.
그리고 키패드의 경우는 그동안 사용해 본 폰중에 거의 최악에 가까운 느낌이었다. 원가절감의 이유인지 키패드의 재질도 굉장히 싸구려 느낌이 강했으며, 클릭감이 굉장히 안좋았다. 특히나 가장 아랫 줄의 * 0 # 의 경우는 눌리는 느낌이 전혀 없었다.
그리고 이 폰을 사용하면서 SKT 통메를 처음 사용해 보았는데....끔찍하였다. 폰의 기본 UI는 전혀 어울리지 않는 못생긴 UI에다가 느리기는 어찌나 느리던지...
제조사 : 삼성
모델명 : SPH-W3600 (팻네임 시크릿컬러폰,보아폰)
통신사 : KTF / 3G HSDPA
사용기간 : 2008년 10월부터 2009년 4월까지
생에 처음으로 사용해본 삼성 핸드폰이며 오직 디자인만을 보고 선택했던 폰.
개인적으로 좋아하는 컬러의 조합은 Black & Red, Black & White, White & Red, 또는 Black & White & Red, Black & Gold, White & Gold
크기도 적당해서 손에 촥 감기는 느낌이 좋았던 기억.
1974년생
강동우 "내가 짬이 좀 되지"
1975년생
신경현 "이글스의 안방마님"
1976년생
박정진 "노, 노망주라니"
1977년생
장성호
정원석 "성호야, 우리 친구야"
정원석 "성호야, 우리 친구야"
1980년생
한상훈
1981년생
이대수 "나 아직 팔팔해"
이양기 "저 빙그레 때 없었어요..."
이양기 "저 빙그레 때 없었어요..."
1982년생
훌리오 데폴라
1983년생
오넬리 페레즈
1984년생
용전동 이영상씨 "경흠이형과 바다에 놀러오니까 너무 좋아요"
1985년생
송창식 "저 아직 파릇파릇 합니다"
1990년생
장민제 "저 90년대생이에요"
1991년생
안승민 "저기요...저 막낸데요"
김용주 "스, 승민씨 저희 친구 맞죠?"
김용주 "스, 승민씨 저희 친구 맞죠?"